{"text_format":"1","workbook":"xlsx","n_sheets":4,"sheets":["Saisie","GM","Département _ Régions","Revision"],"not_rendered":{"charts":0,"images":7,"macros":1,"external_links":0,"defined_names":4,"comments":1,"pivot_tables":0},"unopened":[],"bounds":{"document_bytes":16777216,"sheet_cells":100000,"rows_first":2000,"rows_last":500,"rows_between":2000,"halvings":0,"cell_chars":16384,"cell_head_chars":4096},"cells_cut":0,"cells_raw":0,"read":"whole","date_system":"1900"}

{"sheet":"Saisie","index":0,"n_rows":543,"n_cols":25,"rows_kept":543,"cut":false,"hidden":false,"merged":[[6,13,6,16],[6,17,6,20]]}
["V131",null,"Site usuel",{"$f":"COUNTIF($B$8:$B$1000,C1)","v":305},null,null,null,null,null,null,null,"Version sites","2012-04-02",null,null,null,null,null,"N","E"]
[null,null,"Rassemblement",{"$f":"COUNTIF($B$8:$B$1000,C2)","v":26},null,null,null,null,null,null,null,"Version feuille","15/2/13",null,null,null,null,null,"S","W"]
[null,null,{"$f":"L3","v":"Gîtes ou Camping"},{"$f":"COUNTIF($B$8:$B$1000,C3)","v":107},null,null,null,null,null,"Nous écrire",null,"Gîtes ou Camping"]
[null,null,{"$f":"L4","v":"Observatoire"},{"$f":"COUNTIF($B$8:$B$1000,C4)","v":88},null,null,null,null,null,"GRESAC",null,"Observatoire"]
[null,null,"Nombre de sites total",{"$f":"SUBTOTAL(3,C10:C1000)","v":526},null,null,null,null,null,"AVEX"]
[null,null,"Nombre de sites valides ",{"$f":"SUBTOTAL(3,M10:M1000)","v":518}]
[null,null,null,null,null,null,null,null,null,null,null,null,null,"Latitude",null,null,null,"Longitude"]
["N°","Type","Site ","Dépt","Région","Pays","Commune","Indice PL","Alt","Description","Site Web","Origine","Status","..°",".. '","..''","N/S","..°",".. '","..''","E/W","Lien Site Internet","Image","LOGO","Contact"]
[0,"information",{"$f":"\"- GRESAC - Version \"&A1&\" (ceci n'est pas un POI)\"","v":"- GRESAC - Version V131 (ceci n'est pas un POI)"},75,"-","-","-",0,"-","La couleur des symboles est organisée comme suit : <br><b>Blanc 0-15 étoiles</b> visibles (hors planètes) selon les conditions Pollution. lumineuse très et omniprésente. Typique des très grands centres urbains et grande métropole régionale et nationale <br><b>Magenta : 25-80 d’étoiles</b> visibles, les principales constellations commencent à être reconnaissable <br><b>Rouge : 80 -150 étoiles</b> : les constellations et quelques étoiles supplémentaires apparaissent. Au télescope, certains Messiers se laissent apercevoir <br><b>Orange : 150-250 étoiles</b> visibles, dans de bonnes conditions, la pollution est omniprésente, mais quelques coins de ciel plus noirs apparaissent ; typiquement moyenne banlieue.<br><b>Jaune : 250-500 étoiles</b> : Pollution lumineuse encore forte Voie Lactée peut apparaître dans de très bonnes conditions. Certains Messiers parmi les plus brillants peuvent être perçus à l’oeil nu <br><b>Vert : 500-1000 étoiles</b> : grande banlieue tranquille, faubourg des métropoles, Voie Lactée souvent perceptible, mais très sensible encore aux conditions atmosphériques ; typiquement les halos de pollution lumineuse occupent qu’une partie du Ciel et montent à 40 -50° de hauteur <br><b>Cyan : 1000-1500 étoiles</b> : La Voie Lactée est visible la plupart du temps en fonction des conditions climatiques) mais sans éclats, elle se distingue sans plus <br><b>Bleu : 1500-2000 étoiles</b> : Bon ciel la Voie Lactée se détache assez nettement, on commence à avoir la sentions d’un bon ciel, néanmoins, des sources éparses de pollution lumineuse sabotent encore le ciel ici et la en seconde réflexion, le ciel à la verticale de l’observateur <br><b>Bleu nuit : 2000-3000 étoiles</b> : Bon ciel : Voie Lactée présente et assez puissante les halos lumineux sont très lointain et dispersé, ils n’affectent pas notoirement la qualité du ciel <br><b>Noir : + 3000 étoiles</b> visibles, plus de problèmes de pollution lumineuse décelable sur la qualité du ciel",null,"Ne pas enlever cette ligne - Astrogones","Vxx",48,51,31,"N",2,17,40,"E","http://avex.org.free.fr/dossiers/?page_id=38","http://gresac.free.fr/logo-transparent.png"]
[1,"Site usuel","Aerodrome de Belvezet",30,{"$f":"VLOOKUP(D10,'Département _ Régions'!$C$4:$F$99,4)","v":"Languedoc-Roussillon"},"F","Belvezet",7.5,260,"Sud dégagé mais PL d'uzès devient génante, site privé mis à dispo du club, peu de turbu (venté)","Club Astro Antares (30)","Forum Webastro","v",44,4,56,"N",4,23,33,"E","http://www.club-astro-antares.com/plan_aide.php",null,"http://www.club-astro-antares.com/image/logoCAA.jpg"]
[2,"Site usuel","Aerodrome de Mende Brenoux",48,{"$f":"VLOOKUP(D11,'Département _ Régions'!$C$4:$F$99,4)","v":"Languedoc-Roussillon"},"F","Mende",7.5,1050,"Pour une sortie « sur le pouce » près de Mende, dégagé, spot Disco au N-O et Mende au N",null,"Forum Webastro","v",44,30,45,"N",3,31,35,"E","http://www.webastro.net/forum/showthread.php?p=303070 - post303070"]
[3,"Site usuel","Arcenant",21,{"$f":"VLOOKUP(D12,'Département _ Régions'!$C$4:$F$99,4)","v":"Bourgogne"},"F","Arcenant",7.7,470,null,null,"Forum Futura-Sciences","v",47,7,31,"N",4,50,23,"E","http://forums.futura-sciences.com/post1323871.html - 1323871"]
[4,"Site usuel","Bret",1,{"$f":"VLOOKUP(D13,'Département _ Régions'!$C$4:$F$99,4)","v":"Rhône-Alpes"},"F","Joyeux",7.9,290,"Voie Lactée la plus proche de Lyon, chemin, humide++, pas de ½ tour possible ! Horizon Sud limité par le halo Lyonnais",null,"Forum Webastro","v",45,56,53,"N",5,7,22,"E","http://www.webastro.net/forum/showpost.php?p=247949&postcount=32",null,null,"eric.demarez@free.fr"]
[5,"Site usuel","Buno-Bonnevaux",91,{"$f":"VLOOKUP(D14,'Département _ Régions'!$C$4:$F$99,4)","v":"Ile-de-France"},"F","Buno-Bonnevaux",5,125,"Pas de passage de voitures, mais humidité++",null,"Forum Webastro","v",48,21,29,"N",2,24,42,"E","http://www.webastro.net/forum/showthread.php?p=319695 - post319695"]
[6,"Site usuel","Caserne du Restefond",4,{"$f":"VLOOKUP(D15,'Département _ Régions'!$C$4:$F$99,4)","v":"PACA"},"F","Jausiers",10,2600,"Excellent et très réputé, plusieurs sites possibles",null,null,"v",44,20,40,"N",6,47,49,"E"]
[7,"Site usuel","Chambon des Neiges",63,{"$f":"VLOOKUP(D16,'Département _ Régions'!$C$4:$F$99,4)","v":"Auvergne"},"F","Chambon/Lac",9.6999999999999993,1200,"Petite station de ski, cul de sac, joli « Spot »",null,"Forum Futura-Sciences","v",45,33,21,"N",2,51,22,"E","http://forums.futura-sciences.com/post1329925.html - 1329925"]
[8,"Site usuel","Champ du feu",67,{"$f":"VLOOKUP(D17,'Département _ Régions'!$C$4:$F$99,4)","v":"Alsace"},"F","Belmont",8.1,1050,"Le site le plus connu du quart N-E, vaste et... protégé !  SQM moy 21,1 max 21,5","Collectif pour la prot. du ciel au CDF","Forum Futura-Sciences","v",48,24,10,"N",7,16,4,"E","http://forums.futura-sciences.com/post1329925.html - 1329925","http://www.astrosurf.com/safga/images/cdf20060923_005.jpg"]
[9,"Site usuel","Champ Floux",38,{"$f":"VLOOKUP(D18,'Département _ Régions'!$C$4:$F$99,4)","v":"Rhône-Alpes"},"F","Quincieu",7.9,730,"Dégagé, calme, belle vue, parfois venté, parfois enneigé, chemin herbeux, moins humide que plaines","Albedo 38","Mail GRESAC","v",45,16,31,"N",5,23,55,"E","http://albedo38.free.fr/index.php/accueil"]
[10,"Site usuel","Chapelle St Amand",66,{"$f":"VLOOKUP(D19,'Département _ Régions'!$C$4:$F$99,4)","v":"Languedoc-Roussillon"},"F","Montauriol",8.8000000000000007,270,"Accessible en voiture",null,"Forum Futura-Sciences","v",42,34,30,"N",2,42,2,"E","http://forums.futura-sciences.com/post1325328.html - 1325328","http://gresac.free.fr/photos/montauriol.JPG",null,"steph73.s@orange.fr"]
[11,"Site usuel","Chapelle St Pons",66,{"$f":"VLOOKUP(D20,'Département _ Régions'!$C$4:$F$99,4)","v":"Languedoc-Roussillon"},"F","Caixas",9.3000000000000007,600,"Accessible en voiture",null,"Forum Futura-Sciences","v",42,36,37,"N",2,38,39,"E","http://forums.futura-sciences.com/post1325328.html - 1325328"]
[12,"Site usuel","Château des Portes",30,{"$f":"VLOOKUP(D21,'Département _ Régions'!$C$4:$F$99,4)","v":"Languedoc-Roussillon"},"F","Portes",6,560,"“StarGate” site fréquenté par le club Antares","Club Astro Antares (30)","Forum Webastro","v",44,16,5,"N",4,1,33,"E","http://www.club-astro-antares.com/plan_aide.php",null,"http://www.club-astro-antares.com/image/logoCAA.jpg"]
[13,"Site usuel","Col Agnel",5,{"$f":"VLOOKUP(D22,'Département _ Régions'!$C$4:$F$99,4)","v":"PACA"},"F","Molines-en-Q",10,2700,"Site d'exeption à la frontière avec l'Italie",null,"Forum Astrosurf","v",44,41,2,"N",6,58,47,"E","http://www.astrosurf.com/ubb/Forum2/HTML/024836.html"]
[14,"Site usuel","Col de Beal",63,{"$f":"VLOOKUP(D23,'Département _ Régions'!$C$4:$F$99,4)","v":"Auvergne"},"F","St Pierre la B",9.6999999999999993,1390,null,null,"Forum Webastro","v",45,41,8,"N",3,46,58,"E","http://www.webastro.net/forum/showthread.php?p=322145 - post322145"]
[15,"Site usuel","Col de Boco Jolere",66,{"$f":"VLOOKUP(D24,'Département _ Régions'!$C$4:$F$99,4)","v":"Languedoc-Roussillon"},"F","Campôme",9.6999999999999993,950,"Accessible en voiture",null,"Forum Futura-Sciences","v",42,40,35,"N",2,26,14,"E","http://forums.futura-sciences.com/post1325328.html - 1325328"]
[16,"Site usuel","Col de Fau",38,{"$f":"VLOOKUP(D25,'Département _ Régions'!$C$4:$F$99,4)","v":"Rhône-Alpes"},"F","Monestier-de-C",8.6999999999999993,950,"En fait ce site est précisément au Col de Fraisse mais plus connu sous le nom du col de Fau (ou Col de Faou) un peu plus bas sur la Nationnale.",null,"Forum Webastro","v",44,53,52,"N",5,38,21,"E","http://www.webastro.net/forum/showpost.php?p=262532&postcount=7"]
[17,"Site usuel","Col de Fay 1",1,{"$f":"VLOOKUP(D26,'Département _ Régions'!$C$4:$F$99,4)","v":"Rhône-Alpes"},"F","Fay",7.8,750,"PL vers l'Ouest, mais superbe vue sur la vallée du Rhône, tourner au calvaire, venté, neige",null,"Forum Webastro","v",45,52,52,"N",5,24,36,"E","http://www.webastro.net/forum/showthread.php?p=125349 - post125349","http://storage.canalblog.com/59/90/103640/11535782_p.jpg",null,"eric.demarez@free.fr"]
[18,"Site usuel","Col de Fay 2",1,{"$f":"VLOOKUP(D27,'Département _ Régions'!$C$4:$F$99,4)","v":"Rhône-Alpes"},"F","Fay",7.8,750,"Après le col à dte vers Souclin, abrité par des arbres et généralement déneigé mais horizon un peu limité.",null,"Forum Webastro","v",45,52,38,"N",5,24,24,"E","http://www.webastro.net/forum/showpost.php?p=124142&postcount=1",null,null,"eric.demarez@free.fr"]
[19,"Site usuel","Col de la Baraque",30,{"$f":"VLOOKUP(D28,'Département _ Régions'!$C$4:$F$99,4)","v":"Languedoc-Roussillon"},"F","Lamelouze",8.5,760,"Espece de petite esplanade sur le GR (site du Club Antares)",null,"Forum Webastro","v",44,13,7,"N",3,56,6,"E","http://www.webastro.net/forum/showthread.php?p=306838 - post306838"]
[20,"Site usuel","Cap Blanc Nez",62,{"$f":"VLOOKUP(D29,'Département _ Régions'!$C$4:$F$99,4)","v":"Nord-Pas-de-Calais"},"F","Escalles",6.5,160,"Pas d'éclairage, site naturel classé. Cependant pour s'avancer sur l'extrémité du CAP c'est a pieds ; les voitures y étant interdites. Sur 240° environ c'est la mer, et de l'autre coté les villes de Coquelles, Calais. Un site qui peut etre extrément venteux, mais on peut s'abriter,",null,"Forum Webastro","V82",50,55,30,"N",1,42,34,"E","http://www.webastro.net/forum/showthread.php?p=320169 - post320169"]
[21,"Site usuel","Col de la Madeleine ",84,{"$f":"VLOOKUP(D30,'Département _ Régions'!$C$4:$F$99,4)","v":"PACA"},"F","Bedoin",8.6999999999999993,600,"Moins venté que le Ventoux (!),  bien dans toutes les directions",null,"Forum Webastro","v",44,8,16,"N",5,8,32,"E","http://www.webastro.net/forum/showthread.php?p=320169 - post320169"]
[22,"Site usuel","Col de Morena",66,{"$f":"VLOOKUP(D31,'Département _ Régions'!$C$4:$F$99,4)","v":"Languedoc-Roussillon"},"F","Osseja",9.6999999999999993,2200,"Accessible en voiture",null,"Forum Futura-Sciences","v",42,21,20,"N",2,1,33,"E","http://forums.futura-sciences.com/post1326937.html - 1326937"]
[23,"Site usuel","Col de Portes (Grande bete)",1,{"$f":"VLOOKUP(D32,'Département _ Régions'!$C$4:$F$99,4)","v":"Rhône-Alpes"},"F","Ordonnaz",8.6999999999999993,910,"À G avant d'arriver à Ordonnaz, entre 2 crêts, fréquenté par le club Sirius","Club Sirius Villefontaine","Forum Webastro","v",45,50,34,"N",5,31,14,"E","http://sirius.astroclub.free.fr/","http://img155.imageshack.us/img155/5138/csiteve0.jpg","http://sirius.astroclub.free.fr/images/planetarium/logo_sirius.jpg","eric.demarez@free.fr"]
[24,"Site usuel","Col de portes (Rivoire)",1,{"$f":"VLOOKUP(D33,'Département _ Régions'!$C$4:$F$99,4)","v":"Rhône-Alpes"},"F","Ordonnaz",8.8000000000000007,880,"Entre le col et Ordonnaz, à droite entre 2 champs, vue sur la vallée du Rhône au loin. Horizon un peu limité à l'Est. Quelques passages de voitures.",null,"Forum Webastro","v",45,50,38,"N",5,30,20,"E","http://www.webastro.net/forum/showpost.php?p=168910&postcount=15",null,null,"eric.demarez@free.fr"]
[25,"Site usuel","Col des Abeilles",84,{"$f":"VLOOKUP(D34,'Département _ Régions'!$C$4:$F$99,4)","v":"PACA"},"F","Monieux",9.6999999999999993,1000,"Super pour le S, le S-E et le S-O, 2 sites de part et d'autre de la route",null,"Forum Webastro","v",44,5,34,"N",5,19,46,"E","http://www.webastro.net/forum/showthread.php?p=320169 - post320169"]
[26,"Site usuel","Col du Breitfirst",68,{"$f":"VLOOKUP(D35,'Département _ Régions'!$C$4:$F$99,4)","v":"Alsace"},"F","Oderen",8.9,1250,"Près du Markstein, route des crêtes, Un probleme, lorsqu'il y a du vent, on a que les yeux pour pleurer. Sinon, une bonne transparance du ciel et les 4 horizons quasi dégagés. Inaccessible en hiver, le site se trouvant sur la route des cretes, la route n'est pas déneigée. Le reste du temps, qques passages de voitures",null,"Mail GRESAC","v",47,57,8,"N",7,2,1,"E"]
[27,"Site usuel","Col du Coq",38,{"$f":"VLOOKUP(D36,'Département _ Régions'!$C$4:$F$99,4)","v":"Rhône-Alpes"},"F","St Pancrasse",8,1450,"Peu de PL, Nord bouché, bien dégagé à l'E et O",null,"Forum Futura-Sciences","v",45,18,5,"N",5,50,2,"E","http://forums.futura-sciences.com/post1384616.html - 1384616"]
[28,"Site usuel","Col du Grand Colombier",1,{"$f":"VLOOKUP(D37,'Département _ Régions'!$C$4:$F$99,4)","v":"Rhône-Alpes"},"F","Virieu-le-Petit",8.9,1500,"Grand parking, parfois fréquenté, venté ?",null,null,"v",45,54,13,"N",5,45,43,"E"]
[29,"Site usuel","Col d'Uglas Citerne",30,{"$f":"VLOOKUP(D38,'Département _ Régions'!$C$4:$F$99,4)","v":"Languedoc-Roussillon"},"F","Mialet",9,540,null,"Club Astro Antares (30)","Forum Webastro","v",44,8,40,"N",3,55,26,"E","http://www.club-astro-antares.com/plan_aide.php",null,"http://www.club-astro-antares.com/image/logoCAA.jpg"]
[30,"Site usuel","Col d'Uglas Piste",30,{"$f":"VLOOKUP(D39,'Département _ Régions'!$C$4:$F$99,4)","v":"Languedoc-Roussillon"},"F","Mialet",8.8000000000000007,670,"la Pl d'ales monte à plus de quarante degrés à l'est ","Club Astro Antares (30)","Forum Webastro","v",44,8,28,"N",3,56,58,"E","http://www.club-astro-antares.com/plan_aide.php",null,"http://www.club-astro-antares.com/image/logoCAA.jpg"]
[31,"Site usuel","Cormet de Roselend",73,{"$f":"VLOOKUP(D40,'Département _ Régions'!$C$4:$F$99,4)","v":"Rhône-Alpes"},"F","Beaufort/Doron",9.8000000000000007,2000,"Un peu de PL à l'O par Alberville",null,"Forum Webastro","v",45,41,30,"N",6,41,21,"E","http://www.webastro.net/forum/showthread.php?p=271478 - post271478",null,null,"eric.demarez@free.fr"]
{"$rows_left_out":504}
{"sheet":"GM","index":1,"n_rows":19,"n_cols":14,"rows_kept":19,"cut":false,"hidden":false,"merged":[[6,3,6,6],[3,3,3,4],[5,10,5,12],[1,3,1,5],[4,3,4,7],[5,3,5,7]]}
[]
[null,null,"Site ","Observatoire de Biscarmiau",null,null,"Longitude",43.144444444444446]
[null,null,"Département ",65,{"$f":"VLOOKUP(D3,'Département _ Régions'!$C$4:$F$99,2)","v":"Hautes-Pyrénées"},null,"Latitude",5.8888888888888893E-2]
[null,null,"Commune ","Visker"]
[null,null,"Site Internet ","http://www.dinastro.org/"]
[null,null,"image ","http://www.dinastro.org/IMG/jpg_actu_observ01.jpg"]
[null,null,"logo ","http://www.dinastro.org/local/cache-vignettes/L107xH90/siteon0-16bf1.png",null,null,null,null,null,null,"LOGO"]
[]
[]
[]
[]
[null,null,null,null,null,null,null,null,null,null,null,null,null,"SITE INTERNET"]
[]
[]
[]
[]
[]
[]
[null,null,null,null,null,null,null,null,null,null,null,null,null,"IMAGE"]

{"sheet":"Département _ Régions","index":2,"n_rows":99,"n_cols":6,"rows_kept":99,"cut":false,"hidden":false,"merged":[]}
[]
[]
[null,null,"Département","Dept","Prefecture","Region"]
[null,null,1,"Ain","Bourg-en-Bresse","Rhône-Alpes"]
[null,null,2,"Aisne","Laon","Picardie"]
[null,null,3,"Allier","Moulins","Auvergne"]
[null,null,4,"Alpes de Hautes-Provence","Digne","PACA"]
[null,null,5,"Hautes-Alpes","Gap","PACA"]
[null,null,6,"Alpes-Maritimes","Nice","PACA"]
[null,null,7,"Ardèche","Privas","Rhône-Alpes"]
[null,null,8,"Ardennes","Charleville-Mézières","Champagne-Ardenne"]
[null,null,9,"Ariège","Foix","Midi-Pyrénées"]
[null,null,10,"Aube","Troyes","Champagne-Ardenne"]
[null,null,11,"Aude","Carcassonne","Languedoc-Roussillon"]
[null,null,12,"Aveyron","Rodez","Midi-Pyrénées"]
[null,null,13,"Bouches-du-Rhône","Marseille","PACA"]
[null,null,14,"Calvados","Caen","Basse-Normandie"]
[null,null,15,"Cantal","Aurillac","Auvergne"]
[null,null,16,"Charente","Angoulême","Poitou-Charentes"]
[null,null,17,"Charente-Maritime","La Rochelle","Poitou-Charentes"]
[null,null,18,"Cher","Bourges","Centre"]
[null,null,19,"Corrèze","Tulle","Limousin"]
[null,null,"2A","Corse-du-Sud","Ajaccio","Corse"]
[null,null,"2B","Haute-Corse","Bastia","Corse"]
[null,null,21,"Côte-d'Or","Dijon","Bourgogne"]
[null,null,22,"Côtes d'Armor","Saint-Brieuc","Bretagne"]
[null,null,23,"Creuse","Guéret","Limousin"]
[null,null,24,"Dordogne","Périgueux","Aquitaine"]
[null,null,25,"Doubs","Besançon","Franche-Comté"]
[null,null,26,"Drôme","Valence","Rhône-Alpes"]
[null,null,27,"Eure","Évreux","Haute-Normandie"]
[null,null,28,"Eure-et-Loir","Chartres","Centre"]
[null,null,29,"Finistère","Quimper","Bretagne"]
[null,null,30,"Gard","Nîmes","Languedoc-Roussillon"]
[null,null,31,"Haute-Garonne","Toulouse","Midi-Pyrénées"]
[null,null,32,"Gers","Auch","Midi-Pyrénées"]
[null,null,33,"Gironde","Bordeaux","Aquitaine"]
[null,null,34,"Hérault","Montpellier","Languedoc-Roussillon"]
[null,null,35,"Ille-et-Vilaine","Rennes","Bretagne"]
[null,null,36,"Indre","Châteauroux","Centre"]
{"$rows_left_out":60}
{"sheet":"Revision","index":3,"n_rows":32,"n_cols":3,"rows_kept":32,"cut":false,"hidden":false,"merged":[]}
[]
[null,"Modif","Date"]
[null,"Version initiale","2007-10-29"]
[null,"Modif region \"Provence-Alpes-Côte d'Azur\"en \"PACA\"","2007-11-07"]
[null,"Accents supprimés"]
[null,"Ajout champ \"Commentaires\""]
[null,"Correction de TRI","2007-11-10"]
[null,"Ajout champ Canton + POI Version","2007-11-13"]
[null,"Version GRESAC dans chaque POI","2007-11-21"]
[null,"Correction lien POI Gresac, et page Export","2007-12-06"]
[null,"Nouvelle colonne Type (site public, oservatoire,…)","2007-12-13"]
[null,"correction etendu TRI à colonne \"v\"","2007-12-21"]
[null,"\"Gites ou Camping\" au lieu de \"gîtes/Camping\"","2007-12-26"]
[null,"Logo GRESAC","2007-12-27"]
[null,"Colonne \"Commune\" et N/S, E/W pour les coordonnées","2007-12-28"]
[null,"correction colonne département ","2008-01-02"]
[null,"correction bouton de tri","2008-01-03"]
[null,"Ajout colonne \"Site_Internet\", \"Image\", \"Origine\"","2008-01-07"]
[null,"Ajout colonne \"LOGO\"","2008-01-22"]
[null,"Changement \"Site public\" en \"Site usuel\"","2008-02-04"]
[null,"Tri à partir de la ligne 7","2008-02-09"]
[null,"Liste N/S et E/W","2008-02-16"]
[null,"Ajout quantité par type de site","2008-02-24"]
[null,"Volet figer + Tri","2008-02-29"]
[null,"Tri jusqu'à ligne 300","2008-03-18"]
[null,"Ajout colonne Site (nom assos, gite)","2008-03-28"]
[null,"Intégration GM","2008-05-22"]
[null,"Tri sur altitude","2008-05-28"]
[null,"Erreur liaison externe et liste \"type de site\" disparu","2008-06-09"]
[null,"TRI limité à 300 lignes, augmenté à 500","2008-11-29"]
[null,"correction carte site free et non plus club-internet","2009-11-01"]
[null,"Reprise JM avec Excel 2013 - Extension à 1000 sites","2013-02-15"]